Reaction Details
TargetAldo-keto reductase family 1 member C2
LigandBDBM26269
Substrate/Competitorn/a
Meas. Tech.ChEMBL_684684 (CHEMBL1285651)
Ki 70±n/a nM
Citation El-Kabbani, OScammells, PJDay, TDhagat, UEndo, SMatsunaga, TSoda, MHara, A Structure-based optimization and biological evaluation of human 20a-hydroxysteroid dehydrogenase (AKR1C1) salicylic acid-based inhibitors. Eur J Med Chem45:5309-17 (2010) 
 
Aldo-keto reductase family 1 member C2
Name:Aldo-keto reductase family 1 member C2
Type:Enzyme
Mol. Mass.:36739.89
Organism:Homo sapiens (Human)
Description:n/a
Residue:323
BDBM26269
NameBDBM26269
Synonyms:3,5-dichloro-2-hydroxybenzoic acid CHEMBL449129
TypeSmall organic molecule
Emp. Form.C7H4Cl2O3
Mol. Mass.207.011
SMILESOC(=O)c1cc(Cl)cc(Cl)c1O