Reaction Details
TargetAldo-keto reductase family 1 member C2
LigandBDBM50219490
Substrate/Competitorn/a
Meas. Tech.ChEMBL_684684 (CHEMBL1285651)
Ki 87±n/a nM
Citation El-Kabbani, OScammells, PJDay, TDhagat, UEndo, SMatsunaga, TSoda, MHara, A Structure-based optimization and biological evaluation of human 20a-hydroxysteroid dehydrogenase (AKR1C1) salicylic acid-based inhibitors. Eur J Med Chem45:5309-17 (2010) 
 
Aldo-keto reductase family 1 member C2
Name:Aldo-keto reductase family 1 member C2
Type:Enzyme
Mol. Mass.:36739.89
Organism:Homo sapiens (Human)
Description:n/a
Residue:323
BDBM50219490
NameBDBM50219490
Synonyms:3-Bromo-5-phenylsalicylc acid CHEMBL387536
TypeSmall organic molecule
Emp. Form.C13H9BrO3
Mol. Mass.293.113
SMILESOC(=O)c1cc(cc(Br)c1O)-c1ccccc1