Reaction Details
Target5-hydroxytryptamine receptor 6
LigandBDBM50330511
Substrate/Competitorn/a
Meas. Tech.ChEMBL_684952 (CHEMBL1286367)
Ki 1.6±n/a nM
Citation Liu, KGRobichaud, AJBernotas, RCYan, YLo, JRZhang, MYHughes, ZAHuselton, CZhang, GMZhang, JYKowal, DMSmith, DLSchechter, LEComery, TA 5-Piperazinyl-3-sulfonylindazoles as potent and selective 5-hydroxytryptamine-6 antagonists. J Med Chem53:7639-46 (2010) 
 
5-hydroxytryptamine receptor 6
Name:5-hydroxytryptamine receptor 6
Type:G Protein-Coupled Receptor (GPCR)
Mol. Mass.:46968.43
Organism:Homo sapiens (Human)
Description:P50406
Residue:440
BDBM50330511
NameBDBM50330511
Synonyms:5-(4-Methylpiperazin-1-yl)-3-(1-naphthalenesulfonyl)-1H-indazole | CHEMBL1277104
TypeSmall organic molecule
Emp. Form.C22H22N4O2S
Mol. Mass.406.501
SMILESCN1CCN(CC1)c1ccc2[nH]nc(c2c1)S(=O)(=O)c1cccc2ccccc12