Reaction Details
TargetKinesin-like protein KIF11
LigandBDBM50330561
Substrate/Competitorn/a
Meas. Tech.ChEMBL_685005 (CHEMBL1286523)
IC50 2760±n/a nM
Citation Fu, RGYou, QDYang, LWu, WTJiang, CXu, XL Design, synthesis and bioevaluation of dihydropyrazolo[3,4-b]pyridine and benzo[4,5]imidazo[1,2-a]pyrimidine compounds as dual KSP and Aurora-A kinase inhibitors for anti-cancer agents. Bioorg Med Chem18:8035-43 (2010) 
 
Kinesin-like protein KIF11
Name:Kinesin-like protein KIF11
Type:PROTEIN
Mol. Mass.:119138.97
Organism:Homo sapiens (Human)
Description:ChEMBL_1457426
Residue:1056
BDBM50330561
NameBDBM50330561
Synonyms:4-Furan-6-methyl-N-(4-nitrophenyl)-4,7-dihydro-2Hpyrazole[3,4-b]pyridine-5-carboxamide | CHEMBL1277110
TypeSmall organic molecule
Emp. Form.C18H15N5O4
Mol. Mass.365.3428
SMILESCC1=Nc2[nH]ncc2C(C1C(=O)Nc1ccc(cc1)[N+]([O-])=O)c1ccco1