Reaction Details
TargetKinesin-like protein KIF11
LigandBDBM50330559
Substrate/Competitorn/a
Meas. Tech.ChEMBL_685005 (CHEMBL1286523)
IC50 3320±n/a nM
Citation Fu, RGYou, QDYang, LWu, WTJiang, CXu, XL Design, synthesis and bioevaluation of dihydropyrazolo[3,4-b]pyridine and benzo[4,5]imidazo[1,2-a]pyrimidine compounds as dual KSP and Aurora-A kinase inhibitors for anti-cancer agents. Bioorg Med Chem18:8035-43 (2010) 
 
Kinesin-like protein KIF11
Name:Kinesin-like protein KIF11
Type:PROTEIN
Mol. Mass.:119138.97
Organism:Homo sapiens (Human)
Description:ChEMBL_1457426
Residue:1056
BDBM50330559
NameBDBM50330559
Synonyms:CHEMBL1277382 | N-(4-Trifluoromethylbenzyl)-4-furan-2-methyl-1,4-dihy dro-benzo[4,5]imidazo[1,2-a]pyrimidine-3-carboxamide
TypeSmall organic molecule
Emp. Form.C23H17F3N4O2
Mol. Mass.438.4019
SMILESCC1=Nc2nc3ccccc3n2C(C1C(=O)Nc1ccc(cc1)C(F)(F)F)c1ccco1