Reaction Details
TargetAurora kinase A
LigandBDBM50330547
Substrate/Competitorn/a
Meas. Tech.ChEMBL_685006 (CHEMBL1286524)
IC50>50000±n/a nM
Citation Fu, RGYou, QDYang, LWu, WTJiang, CXu, XL Design, synthesis and bioevaluation of dihydropyrazolo[3,4-b]pyridine and benzo[4,5]imidazo[1,2-a]pyrimidine compounds as dual KSP and Aurora-A kinase inhibitors for anti-cancer agents. Bioorg Med Chem18:8035-43 (2010) 
 
Aurora kinase A
Name:Aurora kinase A
Type:Serine/threonine-protein kinase
Mol. Mass.:45830.98
Organism:Homo sapiens (Human)
Description:O14965
Residue:403
BDBM50330547
NameBDBM50330547
Synonyms:4-Thiophene-6-methyl-N-(4-methoxyphenyl)-4,7-dihydro-2H-pyrazole[3,4-b]pyridine-5-carboxamide | CHEMBL1276930
TypeSmall organic molecule
Emp. Form.C19H18N4O2S
Mol. Mass.366.437
SMILESCOc1ccc(NC(=O)C2C(c3cccs3)c3cn[nH]c3N=C2C)cc1