Reaction Details
TargetAurora kinase A
LigandBDBM50330552
Substrate/Competitorn/a
Meas. Tech.ChEMBL_685006 (CHEMBL1286524)
IC50>50000±n/a nM
Citation Fu, RGYou, QDYang, LWu, WTJiang, CXu, XL Design, synthesis and bioevaluation of dihydropyrazolo[3,4-b]pyridine and benzo[4,5]imidazo[1,2-a]pyrimidine compounds as dual KSP and Aurora-A kinase inhibitors for anti-cancer agents. Bioorg Med Chem18:8035-43 (2010) 
 
Aurora kinase A
Name:Aurora kinase A
Type:Serine/threonine-protein kinase
Mol. Mass.:45830.98
Organism:Homo sapiens (Human)
Description:O14965
Residue:403
BDBM50330552
NameBDBM50330552
Synonyms:4-Thiophene-6-methyl-N-(4-trifluoromethylphenyl)-4,7-dihydro-2H-pyrazole[3,4-b]pyridine-5-carboxamide | CHEMBL1277016
TypeSmall organic molecule
Emp. Form.C19H15F3N4OS
Mol. Mass.404.409
SMILESCC1=Nc2[nH]ncc2C(C1C(=O)Nc1ccc(cc1)C(F)(F)F)c1cccs1