Reaction Details
TargetBeta-secretase 1
LigandBDBM50330566
Substrate/Competitorn/a
Meas. Tech.ChEMBL_685022 (CHEMBL1286540)
IC50 2300±n/a nM
Citation Bertini, SGhilardi, EAsso, VGranchi, CMinutolo, FPineschi, MDi Bussolo, VBortolato, AMoro, SSaba, AMacchia, M BACE1 inhibitory activities of enantiomerically pure, variously substituted N-(3-(4-benzhydrylpiperazin-1-yl)-2-hydroxypropyl) arylsulfonamides. Bioorg Med Chem18:7991-6 (2010) 
 
Beta-secretase 1
Name:Beta-secretase 1
Type:Protein
Mol. Mass.:55755.10
Organism:Homo sapiens (Human)
Description:P56817
Residue:501
BDBM50330566
NameBDBM50330566
Synonyms:CHEMBL1275914 | N-[(R)-3-(4-Benzhydryl-piperazin-1-yl)-2-hydroxy-propyl]-4-chloro-N-phenethyl-benzenesulfonamide
TypeSmall organic molecule
Emp. Form.C34H38ClN3O3S
Mol. Mass.604.202
SMILESO[C@@H](CN(CCc1ccccc1)S(=O)(=O)c1ccc(Cl)cc1)CN1CCN(CC1)C(c1ccccc1)c1ccccc1