Reaction Details
TargetBeta-secretase 1
LigandBDBM50330573
Substrate/Competitorn/a
Meas. Tech.ChEMBL_685022 (CHEMBL1286540)
IC50 4700±n/a nM
Citation Bertini, SGhilardi, EAsso, VGranchi, CMinutolo, FPineschi, MDi Bussolo, VBortolato, AMoro, SSaba, AMacchia, M BACE1 inhibitory activities of enantiomerically pure, variously substituted N-(3-(4-benzhydrylpiperazin-1-yl)-2-hydroxypropyl) arylsulfonamides. Bioorg Med Chem18:7991-6 (2010) 
 
Beta-secretase 1
Name:Beta-secretase 1
Type:Protein
Mol. Mass.:55755.10
Organism:Homo sapiens (Human)
Description:P56817
Residue:501
BDBM50330573
NameBDBM50330573
Synonyms:CHEMBL1276932 | N-[(S)-3-(4-Benzhydryl-piperazin-1-yl)-2-hydroxy-propyl]-3,4-dichloro-N-cyclopropylmethyl-benzenesulfonamide
TypeSmall organic molecule
Emp. Form.C30H35Cl2N3O3S
Mol. Mass.588.588
SMILESO[C@H](CN(CC1CC1)S(=O)(=O)c1ccc(Cl)c(Cl)c1)CN1CCN(CC1)C(c1ccccc1)c1ccccc1