Reaction Details
TargetAdenosine receptor A3
LigandBDBM50039951
Substrate/Competitorn/a
Meas. Tech.ChEMBL_685070 (CHEMBL1286686)
Ki 2.1±n/a nM
Citation Giovannoni, MPVergelli, CCilibrizzi, ACrocetti, LBiancalani, CGraziano, ADal Piaz, VLoza, MICadavid, MIDíaz, JLGavaldà, A Pyrazolo[1',5':1,6]pyrimido[4,5-d]pyridazin-4(3H)-ones as selective human A(1) adenosine receptor ligands. Bioorg Med Chem18:7890-9 (2010) 
 
Adenosine receptor A3
Name:Adenosine receptor A3
Type:G Protein-Coupled Receptor (GPCR)
Mol. Mass.:36197.32
Organism:Homo sapiens (Human)
Description:P0DMS8
Residue:318
BDBM50039951
NameBDBM50039951
Synonyms:2-(4-Methoxy-phenyl)-5H-[1,2,4]triazolo[1,5-a]quinoxalin-4-one CHEMBL99178
TypeSmall organic molecule
Emp. Form.C16H12N4O2
Mol. Mass.292.2921
SMILESCOc1ccc(cc1)-c1nc2n(n1)c1ccccc1[nH]c2=O