Reaction Details
TargetAdenosine receptor A1
LigandBDBM50102282
Substrate/Competitorn/a
Meas. Tech.ChEMBL_685063 (CHEMBL1286679)
Ki 18±n/a nM
Citation Giovannoni, MPVergelli, CCilibrizzi, ACrocetti, LBiancalani, CGraziano, ADal Piaz, VLoza, MICadavid, MIDíaz, JLGavaldà, A Pyrazolo[1',5':1,6]pyrimido[4,5-d]pyridazin-4(3H)-ones as selective human A(1) adenosine receptor ligands. Bioorg Med Chem18:7890-9 (2010) 
 
Adenosine receptor A1
Name:Adenosine receptor A1
Type:Enzyme Catalytic Domain
Mol. Mass.:36602.99
Organism:BOVINE
Description:ADENOSINE 0 BOVINE::P28190
Residue:326
BDBM50102282
NameBDBM50102282
Synonyms:3,10-Diphenyl-10H-benzo[4,5]imidazo[2,1-c][1,2,4]triazin-4-one | CHEMBL112756
TypeSmall organic molecule
Emp. Form.C21H14N4O
Mol. Mass.338.3621
SMILESO=c1c(nnc2n(-c3ccccc3)c3ccccc3n12)-c1ccccc1