Reaction Details
TargetTransient receptor potential cation channel subfamily V member 1
LigandBDBM50330644
Substrate/Competitorn/a
Meas. Tech.ChEMBL_685080 (CHEMBL1286696)
Ki 17.2±n/a nM
Citation Kang, DWKim, YSLim, KSKim, MSPearce, LVPavlyukovets, VATao, AKLang-Kuhs, KABlumberg, PMLee, J Halogenation of 4-hydroxy/amino-3-methoxyphenyl acetamide TRPV1 agonists showed enhanced antagonism to capsaicin. Bioorg Med Chem18:8092-105 (2010) 
 
Transient receptor potential cation channel subfamily V member 1
Name:Transient receptor potential cation channel subfamily V member 1
Type:Transient Receptor
Mol. Mass.:94956.12
Organism:Rattus norvegicus (rat)
Description:O35433
Residue:838
BDBM50330644
NameBDBM50330644
Synonyms:CHEMBL1277117 | N-(4-tert-Butyl-benzyl)-2-(3-iodo-4-hydroxy-5-methoxyphenyl)acetamide
TypeSmall organic molecule
Emp. Form.C20H24INO3
Mol. Mass.453.3139
SMILESCOc1cc(CC(=O)NCc2ccc(cc2)C(C)(C)C)cc(I)c1O