Reaction Details
TargetTransient receptor potential cation channel subfamily V member 1
LigandBDBM50330654
Substrate/Competitorn/a
Meas. Tech.ChEMBL_685077 (CHEMBL1286693)
Ki 13.1±n/a nM
Citation Kang, DWKim, YSLim, KSKim, MSPearce, LVPavlyukovets, VATao, AKLang-Kuhs, KABlumberg, PMLee, J Halogenation of 4-hydroxy/amino-3-methoxyphenyl acetamide TRPV1 agonists showed enhanced antagonism to capsaicin. Bioorg Med Chem18:8092-105 (2010) 
 
Transient receptor potential cation channel subfamily V member 1
Name:Transient receptor potential cation channel subfamily V member 1
Type:Transient Receptor
Mol. Mass.:94956.12
Organism:Rattus norvegicus (rat)
Description:O35433
Residue:838
BDBM50330654
NameBDBM50330654
Synonyms:CHEMBL1277576 | N-[3-pivaloyloxy-2-(4-t-butylbenzyl)propyl]-2-(4-hydroxy-3-methoxyphenyl)acetamide
TypeSmall organic molecule
Emp. Form.C28H39NO5
Mol. Mass.469.613
SMILESCOc1cc(CC(=O)NCC(COC(=O)C(C)(C)C)Cc2ccc(cc2)C(C)(C)C)ccc1O