Reaction Details
TargetTransient receptor potential cation channel subfamily V member 1
LigandBDBM50330672
Substrate/Competitorn/a
Meas. Tech.ChEMBL_685080 (CHEMBL1286696)
Ki 4.26±n/a nM
Citation Kang, DWKim, YSLim, KSKim, MSPearce, LVPavlyukovets, VATao, AKLang-Kuhs, KABlumberg, PMLee, J Halogenation of 4-hydroxy/amino-3-methoxyphenyl acetamide TRPV1 agonists showed enhanced antagonism to capsaicin. Bioorg Med Chem18:8092-105 (2010) 
 
Transient receptor potential cation channel subfamily V member 1
Name:Transient receptor potential cation channel subfamily V member 1
Type:Transient Receptor
Mol. Mass.:94956.12
Organism:Rattus norvegicus (rat)
Description:O35433
Residue:838
BDBM50330672
NameBDBM50330672
Synonyms:2-(4-tert-Butylbenzyl)-3-[2-(3,5-dichloro-4-hydroxyphenyl)acetamido]propyl pivalate | CHEMBL1276941
TypeSmall organic molecule
Emp. Form.C27H35Cl2NO4
Mol. Mass.508.477
SMILESCC(C)(C)C(=O)OCC(CNC(=O)Cc1cc(Cl)c(O)c(Cl)c1)Cc1ccc(cc1)C(C)(C)C