Reaction Details
TargetTransient receptor potential cation channel subfamily V member 1
LigandBDBM50330673
Substrate/Competitorn/a
Meas. Tech.ChEMBL_685080 (CHEMBL1286696)
Ki 10.7±n/a nM
Citation Kang, DWKim, YSLim, KSKim, MSPearce, LVPavlyukovets, VATao, AKLang-Kuhs, KABlumberg, PMLee, J Halogenation of 4-hydroxy/amino-3-methoxyphenyl acetamide TRPV1 agonists showed enhanced antagonism to capsaicin. Bioorg Med Chem18:8092-105 (2010) 
 
Transient receptor potential cation channel subfamily V member 1
Name:Transient receptor potential cation channel subfamily V member 1
Type:Transient Receptor
Mol. Mass.:94956.12
Organism:Rattus norvegicus (rat)
Description:O35433
Residue:838
BDBM50330673
NameBDBM50330673
Synonyms:2-(4-tert-Butylbenzyl)-3-[2-(3,5-dibromo-4-hydroxyphenyl)acetamido]propyl pivalate | CHEMBL1276942
TypeSmall organic molecule
Emp. Form.C27H35Br2NO4
Mol. Mass.597.379
SMILESCC(C)(C)C(=O)OCC(CNC(=O)Cc1cc(Br)c(O)c(Br)c1)Cc1ccc(cc1)C(C)(C)C