Reaction Details
TargetTransient receptor potential cation channel subfamily V member 1
LigandBDBM50330676
Substrate/Competitorn/a
Meas. Tech.ChEMBL_685080 (CHEMBL1286696)
Ki 4.09±n/a nM
Citation Kang, DWKim, YSLim, KSKim, MSPearce, LVPavlyukovets, VATao, AKLang-Kuhs, KABlumberg, PMLee, J Halogenation of 4-hydroxy/amino-3-methoxyphenyl acetamide TRPV1 agonists showed enhanced antagonism to capsaicin. Bioorg Med Chem18:8092-105 (2010) 
 
Transient receptor potential cation channel subfamily V member 1
Name:Transient receptor potential cation channel subfamily V member 1
Type:Transient Receptor
Mol. Mass.:94956.12
Organism:Rattus norvegicus (rat)
Description:O35433
Residue:838
BDBM50330676
NameBDBM50330676
Synonyms:2-(4-tert-Butylbenzyl)-3-[2-(4-amino-3-chloro-5-methoxyphenyl)acetamido]propyl pivalate | CHEMBL1277119
TypeSmall organic molecule
Emp. Form.C28H39ClN2O4
Mol. Mass.503.073
SMILESCOc1cc(CC(=O)NCC(COC(=O)C(C)(C)C)Cc2ccc(cc2)C(C)(C)C)cc(Cl)c1N