Reaction Details
TargetNADPH oxidase 4
LigandBDBM50330704
Substrate/Competitorn/a
Meas. Tech.ChEMBL_685143 (CHEMBL1286959)
Ki 215±n/a nM
Citation Laleu, BGaggini, FOrchard, MFioraso-Cartier, LCagnon, LHoungninou-Molango, SGradia, ADuboux, GMerlot, CHeitz, FSzyndralewiez, CPage, P First in class, potent, and orally bioavailable NADPH oxidase isoform 4 (Nox4) inhibitors for the treatment of idiopathic pulmonary fibrosis. J Med Chem53:7715-30 (2010) 
 
NADPH oxidase 4
Name:NADPH oxidase 4
Type:PROTEIN
Mol. Mass.:66954.54
Organism:Homo sapiens (Human)
Description:ChEMBL_792879
Residue:578
BDBM50330704
NameBDBM50330704
Synonyms:2-(2-chlorophenyl)-4,5-dimethyl-1H-pyrazolo[4,3-c]pyridine-3,6(2H,5H)-dione | CHEMBL1276162
TypeSmall organic molecule
Emp. Form.C14H12ClN3O2
Mol. Mass.289.717
SMILESCc1n(C)c(=O)cc2[nH]n(-c3ccccc3Cl)c(=O)c12