Reaction Details
TargetNADPH oxidase 4
LigandBDBM50330718
Substrate/Competitorn/a
Meas. Tech.ChEMBL_685143 (CHEMBL1286959)
Ki 158±n/a nM
Citation Laleu, BGaggini, FOrchard, MFioraso-Cartier, LCagnon, LHoungninou-Molango, SGradia, ADuboux, GMerlot, CHeitz, FSzyndralewiez, CPage, P First in class, potent, and orally bioavailable NADPH oxidase isoform 4 (Nox4) inhibitors for the treatment of idiopathic pulmonary fibrosis. J Med Chem53:7715-30 (2010) 
 
NADPH oxidase 4
Name:NADPH oxidase 4
Type:PROTEIN
Mol. Mass.:66954.54
Organism:Homo sapiens (Human)
Description:ChEMBL_792879
Residue:578
BDBM50330718
NameBDBM50330718
Synonyms:2-(2-chlorophenyl)-4-methyl-5-(3-phenylprop-2-ynyl)-1H-pyrazolo[4,3-c]pyridine-3,6(2H,5H)-dione | CHEMBL1278200
TypeSmall organic molecule
Emp. Form.C22H16ClN3O2
Mol. Mass.389.834
SMILESCc1n(CC#Cc2ccccc2)c(=O)cc2[nH]n(-c3ccccc3Cl)c(=O)c12