Reaction Details
TargetNADPH oxidase 4
LigandBDBM50330732
Substrate/Competitorn/a
Meas. Tech.ChEMBL_685143 (CHEMBL1286959)
Ki 259±n/a nM
Citation Laleu, BGaggini, FOrchard, MFioraso-Cartier, LCagnon, LHoungninou-Molango, SGradia, ADuboux, GMerlot, CHeitz, FSzyndralewiez, CPage, P First in class, potent, and orally bioavailable NADPH oxidase isoform 4 (Nox4) inhibitors for the treatment of idiopathic pulmonary fibrosis. J Med Chem53:7715-30 (2010) 
 
NADPH oxidase 4
Name:NADPH oxidase 4
Type:PROTEIN
Mol. Mass.:66954.54
Organism:Homo sapiens (Human)
Description:ChEMBL_792879
Residue:578
BDBM50330732
NameBDBM50330732
Synonyms:2-(4-chlorobenzyl)-4-methyl-5-(pyridin-2-ylmethyl)-1H-pyrazolo[4,3-c]pyridine-3,6(2H,5H)-dione | CHEMBL1277398
TypeSmall organic molecule
Emp. Form.C20H17ClN4O2
Mol. Mass.380.828
SMILESCc1n(Cc2ccccn2)c(=O)cc2[nH]n(Cc3ccc(Cl)cc3)c(=O)c12