Reaction Details
TargetNADPH oxidase 4
LigandBDBM50330736
Substrate/Competitorn/a
Meas. Tech.ChEMBL_685143 (CHEMBL1286959)
Ki 165±n/a nM
Citation Laleu, BGaggini, FOrchard, MFioraso-Cartier, LCagnon, LHoungninou-Molango, SGradia, ADuboux, GMerlot, CHeitz, FSzyndralewiez, CPage, P First in class, potent, and orally bioavailable NADPH oxidase isoform 4 (Nox4) inhibitors for the treatment of idiopathic pulmonary fibrosis. J Med Chem53:7715-30 (2010) 
 
NADPH oxidase 4
Name:NADPH oxidase 4
Type:PROTEIN
Mol. Mass.:66954.54
Organism:Homo sapiens (Human)
Description:ChEMBL_792879
Residue:578
BDBM50330736
NameBDBM50330736
Synonyms:4-((benzyl(methyl)amino)methyl)-2-(2-chloro-4-fluorophenyl)-5-(3-methoxypropyl)-1H-pyrazolo[4,3-c]pyridine-3,6(2H,5H)-dione | CHEMBL1277582
TypeSmall organic molecule
Emp. Form.C25H26ClFN4O3
Mol. Mass.484.95
SMILESCOCCCn1c(CN(C)Cc2ccccc2)c2c(cc1=O)[nH]n(-c1ccc(F)cc1Cl)c2=O