Reaction Details
TargetNADPH oxidase 4
LigandBDBM50330745
Substrate/Competitorn/a
Meas. Tech.ChEMBL_685143 (CHEMBL1286959)
Ki 114±n/a nM
Citation Laleu, BGaggini, FOrchard, MFioraso-Cartier, LCagnon, LHoungninou-Molango, SGradia, ADuboux, GMerlot, CHeitz, FSzyndralewiez, CPage, P First in class, potent, and orally bioavailable NADPH oxidase isoform 4 (Nox4) inhibitors for the treatment of idiopathic pulmonary fibrosis. J Med Chem53:7715-30 (2010) 
 
NADPH oxidase 4
Name:NADPH oxidase 4
Type:PROTEIN
Mol. Mass.:66954.54
Organism:Homo sapiens (Human)
Description:ChEMBL_792879
Residue:578
BDBM50330745
NameBDBM50330745
Synonyms:2-(2-chlorophenyl)-4-((4-fluorophenoxy)methyl)-5-methyl-1H-pyrazolo[4,3-c]pyridine-3,6(2H,5H)-dione | CHEMBL1277934
TypeSmall organic molecule
Emp. Form.C20H15ClFN3O3
Mol. Mass.399.803
SMILESCn1c(COc2ccc(F)cc2)c2c(cc1=O)[nH]n(-c1ccccc1Cl)c2=O