Reaction Details
TargetPotassium voltage-gated channel subfamily H member 2
LigandBDBM50330748
Substrate/Competitorn/a
Meas. Tech.ChEMBL_685210 (CHEMBL1287098)
IC50>39810.72±n/a nM
Citation Gianotti, MBotta, MBrough, SCarletti, RCastiglioni, ECorti, CDal-Cin, MDelle Fratte, SKorajac, DLovric, MMerlo, GMesic, MPavone, FPiccoli, LRast, SRoscic, MSava, ASmehil, MStasi, LTogninelli, AWigglesworth, MJ Novel spirotetracyclic zwitterionic dual H(1)/5-HT(2A) receptor antagonists for the treatment of sleep disorders. J Med Chem53:7778-95 (2010) 
 
Potassium voltage-gated channel subfamily H member 2
Name:Potassium voltage-gated channel subfamily H member 2
Type:Multi-pass membrane protein
Mol. Mass.:126672.65
Organism:Homo sapiens (Human)
Description:Q12809
Residue:1159
BDBM50330748
NameBDBM50330748
Synonyms:1-((1S)-5',11'-Dihydrospiro[cyclopentane-1,10'-dibenzo[a,d]-cyclohepten]-3-yl)-1,2,5,6-tetrahydro-3-pyridinecarboxylic Acid | CHEMBL1277935
TypeSmall organic molecule
Emp. Form.C25H27NO2
Mol. Mass.373.4874
SMILESOC(=O)C1=CCCN(C1)C1CC[C@@]2(C1)Cc1ccccc1Cc1ccccc21