Reaction Details
TargetPotassium voltage-gated channel subfamily H member 2
LigandBDBM50417355
Substrate/Competitorn/a
Meas. Tech.ChEMBL_685210 (CHEMBL1287098)
IC50 63095.73±n/a nM
Citation Gianotti, MBotta, MBrough, SCarletti, RCastiglioni, ECorti, CDal-Cin, MDelle Fratte, SKorajac, DLovric, MMerlo, GMesic, MPavone, FPiccoli, LRast, SRoscic, MSava, ASmehil, MStasi, LTogninelli, AWigglesworth, MJ Novel spirotetracyclic zwitterionic dual H(1)/5-HT(2A) receptor antagonists for the treatment of sleep disorders. J Med Chem53:7778-95 (2010) 
 
Potassium voltage-gated channel subfamily H member 2
Name:Potassium voltage-gated channel subfamily H member 2
Type:Multi-pass membrane protein
Mol. Mass.:126672.65
Organism:Homo sapiens (Human)
Description:Q12809
Residue:1159
BDBM50417355
NameBDBM50417355
Synonyms:CHEMBL1278114
TypeSmall organic molecule
Emp. Form.C22H25NO2
Mol. Mass.335.4394
SMILESOC(=O)CCNC1CC[C@@]2(C1)Cc1ccccc1Cc1ccccc21