Reaction Details
TargetHistamine H1 receptor
LigandBDBM50330751
Substrate/Competitorn/a
Meas. Tech.ChEMBL_685211 (CHEMBL1287099)
Ki 5.62±n/a nM
Citation Gianotti, MBotta, MBrough, SCarletti, RCastiglioni, ECorti, CDal-Cin, MDelle Fratte, SKorajac, DLovric, MMerlo, GMesic, MPavone, FPiccoli, LRast, SRoscic, MSava, ASmehil, MStasi, LTogninelli, AWigglesworth, MJ Novel spirotetracyclic zwitterionic dual H(1)/5-HT(2A) receptor antagonists for the treatment of sleep disorders. J Med Chem53:7778-95 (2010) 
 
Histamine H1 receptor
Name:Histamine H1 receptor
Type:Enzyme Catalytic Domain
Mol. Mass.:55716.35
Organism:RAT
Description:HISTAMINE H1 HRH1 RAT::P31390
Residue:486
BDBM50330751
NameBDBM50330751
Synonyms:1-((1S)-5',11'-Dihydrospiro[cyclopentane-1,10'-dibenzo[a,d]-cyclohepten]-3-yl)-3-azetidinecarboxylic Acid | CHEMBL1276948
TypeSmall organic molecule
Emp. Form.C23H25NO2
Mol. Mass.347.4501
SMILESOC(=O)C1CN(C1)C1CC[C@@]2(C1)Cc1ccccc1Cc1ccccc21