Reaction Details
TargetSodium channel protein type 2 subunit alpha
LigandBDBM50330763
Substrate/Competitorn/a
Meas. Tech.ChEMBL_685288 (CHEMBL1287300)
IC50 21400±n/a nM
Citation Zuliani, VFantini, MNigam, AStables, JPPatel, MKRivara, M Anticonvulsant activity of 2,4(1H)-diarylimidazoles in mice and rats acute seizure models. Bioorg Med Chem18:7957-65 (2010) 
 
Sodium channel protein type 2 subunit alpha
Name:Sodium channel protein type 2 subunit alpha
Type:Enzyme
Mol. Mass.:227954.68
Organism:Homo sapiens (Human)
Description:Q99250
Residue:2005
BDBM50330763
NameBDBM50330763
Synonyms:2-(4-Methoxyphenyl)-4(5)-phenylimidazole CHEMBL466587
TypeSmall organic molecule
Emp. Form.C16H14N2O
Mol. Mass.250.2952
SMILESCOc1ccc(cc1)-c1nc(c[nH]1)-c1ccccc1