Reaction Details
TargetTransporter
LigandBDBM50330789
Substrate/Competitorn/a
Meas. Tech.ChEMBL_685424 (CHEMBL1285323)
Ki 110±n/a nM
Citation Altenbach, RJBlack, LAStrakhova, MIManelli, AMCarr, TLMarsh, KCWetter, JMWensink, EJHsieh, GCHonore, PGarrison, TRBrioni, JDCowart, MD Diaryldiamines with dual inhibition of the histamine H(3) receptor and the norepinephrine transporter and the efficacy of 4-(3-(methylamino)-1-phenylpropyl)-6-(2-(pyrrolidin-1-yl)ethoxy)naphthalen-1-ol in pain. J Med Chem53:7869-73 (2010) 
 
Transporter
Name:Transporter
Type:Multi-pass membrane protein
Mol. Mass.:69236.90
Organism:Rattus norvegicus (rat)
Description:Q63380
Residue:617
BDBM50330789
NameBDBM50330789
Synonyms:CHEMBL1277501 | N1-Methyl-N3-phenyl-N3-(4-(2-(pyrrolidin-1-yl)ethoxy)phenyl)-propane-1,3-diamine
TypeSmall organic molecule
Emp. Form.C22H31N3O
Mol. Mass.353.501
SMILESCNCCCN(c1ccccc1)c1ccc(OCCN2CCCC2)cc1