Reaction Details
TargetTransporter
LigandBDBM50330791
Substrate/Competitorn/a
Meas. Tech.ChEMBL_685424 (CHEMBL1285323)
Ki 14±n/a nM
Citation Altenbach, RJBlack, LAStrakhova, MIManelli, AMCarr, TLMarsh, KCWetter, JMWensink, EJHsieh, GCHonore, PGarrison, TRBrioni, JDCowart, MD Diaryldiamines with dual inhibition of the histamine H(3) receptor and the norepinephrine transporter and the efficacy of 4-(3-(methylamino)-1-phenylpropyl)-6-(2-(pyrrolidin-1-yl)ethoxy)naphthalen-1-ol in pain. J Med Chem53:7869-73 (2010) 
 
Transporter
Name:Transporter
Type:Multi-pass membrane protein
Mol. Mass.:69236.90
Organism:Rattus norvegicus (rat)
Description:Q63380
Residue:617
BDBM50330791
NameBDBM50330791
Synonyms:CHEMBL1277595 | N-Methyl-4-phenyl-4-(4-(2-(pyrrolidin-1-yl)ethoxy)phenyl)-butan-1-amine
TypeSmall organic molecule
Emp. Form.C23H32N2O
Mol. Mass.352.513
SMILESCNCCCC(c1ccccc1)c1ccc(OCCN2CCCC2)cc1