Reaction Details
TargetHistamine H3 receptor
LigandBDBM50330788
Substrate/Competitorn/a
Meas. Tech.ChEMBL_685425 (CHEMBL1285324)
Ki 5.4±n/a nM
Citation Altenbach, RJBlack, LAStrakhova, MIManelli, AMCarr, TLMarsh, KCWetter, JMWensink, EJHsieh, GCHonore, PGarrison, TRBrioni, JDCowart, MD Diaryldiamines with dual inhibition of the histamine H(3) receptor and the norepinephrine transporter and the efficacy of 4-(3-(methylamino)-1-phenylpropyl)-6-(2-(pyrrolidin-1-yl)ethoxy)naphthalen-1-ol in pain. J Med Chem53:7869-73 (2010) 
 
Histamine H3 receptor
Name:Histamine H3 receptor
Type:G Protein-Coupled Receptor (GPCR)
Mol. Mass.:48607.98
Organism:Rattus norvegicus (rat)
Description:n/a
Residue:445
BDBM50330788
NameBDBM50330788
Synonyms:CHEMBL1277500 | N1-Methyl-N2-phenyl-N2-(4-(2-(pyrrolidin-1-yl)ethoxy)phenyl)-ethane-1,2-diamine
TypeSmall organic molecule
Emp. Form.C21H29N3O
Mol. Mass.339.4745
SMILESCNCCN(c1ccccc1)c1ccc(OCCN2CCCC2)cc1