Reaction Details
TargetPolyphenol oxidase 2
LigandBDBM50031467
Substrate/Competitorn/a
Meas. Tech.ChEMBL_685471 (CHEMBL1285502)
IC50 53700±n/a nM
Citation Takahashi, SKamiya, TSaeki, KNezu, TTakeuchi, STakasawa, RSunaga, SYoshimori, AEbizuka, SAbe, TTanuma, S Structural insights into the hot spot amino acid residues of mushroom tyrosinase for the bindings of thujaplicins. Bioorg Med Chem18:8112-8 (2010) 
 
Polyphenol oxidase 2
Name:Polyphenol oxidase 2
Type:Protein
Mol. Mass.:63923.66
Organism:Agaricus bisporus (Common mushroom)
Description:O42713
Residue:556
BDBM50031467
NameBDBM50031467
Synonyms:5-HYDROXY-2-(HYDROXYMETHYL)-4H-PYRAN-4-ONE CHEMBL287556 US10857082, Kojic acid US9682910, kojic acid
TypeSmall organic molecule
Emp. Form.C6H6O4
Mol. Mass.142.1094
SMILESOCc1cc(=O)c(O)co1