Reaction Details
TargetPolyphenol oxidase 2
LigandBDBM50330793
Substrate/Competitorn/a
Meas. Tech.ChEMBL_685472 (CHEMBL1285503)
Ki 3300±n/a nM
Citation Takahashi, SKamiya, TSaeki, KNezu, TTakeuchi, STakasawa, RSunaga, SYoshimori, AEbizuka, SAbe, TTanuma, S Structural insights into the hot spot amino acid residues of mushroom tyrosinase for the bindings of thujaplicins. Bioorg Med Chem18:8112-8 (2010) 
 
Polyphenol oxidase 2
Name:Polyphenol oxidase 2
Type:Protein
Mol. Mass.:63923.66
Organism:Agaricus bisporus (Common mushroom)
Description:O42713
Residue:556
BDBM50330793
NameBDBM50330793
Synonyms:2-hydroxy-3-isopropyl-2,4,6-cycloheptatrien-1-one | CHEMBL1275969
TypeSmall organic molecule
Emp. Form.C10H12O2
Mol. Mass.164.2011
SMILESCC(C)c1ccccc(=O)c1O