Reaction Details
TargetNitric oxide synthase, inducible
LigandBDBM50330869
Substrate/Competitorn/a
Meas. Tech.ChEMBL_685656 (CHEMBL1285558)
Ki 414±n/a nM
Citation Ji, HDelker, SLLi, HMartásek, PRoman, LJPoulos, TLSilverman, RB Exploration of the active site of neuronal nitric oxide synthase by the design and synthesis of pyrrolidinomethyl 2-aminopyridine derivatives. J Med Chem53:7804-24 (2010) 
 
Nitric oxide synthase, inducible
Name:Nitric oxide synthase, inducible
Type:Enzyme
Mol. Mass.:130595.79
Organism:Mus musculus (mouse)
Description:Recombinant enzyme overexpressed in E. coli.
Residue:1144
BDBM50330869
NameBDBM50330869
Synonyms:CHEMBL1277601 | trans rac-N1-(4-((6-amino-4-methylpyridin-2-yl)methyl)pyrrolidin-3-yl)-N2-(3,4-dichlorobenzyl)ethane-1,2-diamine
TypeSmall organic molecule
Emp. Form.C20H27Cl2N5
Mol. Mass.408.368
SMILESCc1cc(N)nc(C[C@H]2CNC[C@@H]2NCCNCc2ccc(Cl)c(Cl)c2)c1