Reaction Details
TargetNitric oxide synthase, inducible
LigandBDBM29235
Substrate/Competitorn/a
Meas. Tech.ChEMBL_685656 (CHEMBL1285558)
Ki 250±n/a nM
Citation Ji, HDelker, SLLi, HMartásek, PRoman, LJPoulos, TLSilverman, RB Exploration of the active site of neuronal nitric oxide synthase by the design and synthesis of pyrrolidinomethyl 2-aminopyridine derivatives. J Med Chem53:7804-24 (2010) 
 
Nitric oxide synthase, inducible
Name:Nitric oxide synthase, inducible
Type:Enzyme
Mol. Mass.:130595.79
Organism:Mus musculus (mouse)
Description:Recombinant enzyme overexpressed in E. coli.
Residue:1144
BDBM29235
NameBDBM29235
Synonyms:aminopyridine-pyrrolidine, 7
TypeSmall organic molecule
Emp. Form.C20H28ClN5
Mol. Mass.373.923
SMILESCc1cc(N)nc(C[C@H]2CNC[C@@H]2NCCNCc2cccc(Cl)c2)c1