Reaction Details
TargetNitric oxide synthase, inducible
LigandBDBM50330896
Substrate/Competitorn/a
Meas. Tech.ChEMBL_685656 (CHEMBL1285558)
Ki 740±n/a nM
Citation Ji, HDelker, SLLi, HMartásek, PRoman, LJPoulos, TLSilverman, RB Exploration of the active site of neuronal nitric oxide synthase by the design and synthesis of pyrrolidinomethyl 2-aminopyridine derivatives. J Med Chem53:7804-24 (2010) 
 
Nitric oxide synthase, inducible
Name:Nitric oxide synthase, inducible
Type:Enzyme
Mol. Mass.:130595.79
Organism:Mus musculus (mouse)
Description:Recombinant enzyme overexpressed in E. coli.
Residue:1144
BDBM50330896
NameBDBM50330896
Synonyms:CHEMBL1277419 | trans rac-N1-(4-((6-amino-4-methylpyridin-2-yl)methyl)pyrrolidin-3-yl)-N2-(4-(trifluoromethyl)benzyl)ethane-1,2-diamine
TypeSmall organic molecule
Emp. Form.C21H28F3N5
Mol. Mass.407.4757
SMILESCc1cc(N)nc(C[C@H]2CNC[C@@H]2NCCNCc2ccc(cc2)C(F)(F)F)c1