Reaction Details
TargetSerine/threonine-protein kinase B-raf
LigandBDBM50026207
Substrate/Competitorn/a
Meas. Tech.ChEMBL_685663 (CHEMBL1285565)
IC50<0.100000±n/a nM
Citation Wang, XBerger, DMSalaski, EJTorres, NDutia, MHanna, CHu, YLevin, JIPowell, DWojciechowicz, DCollins, KFrommer, ELucas, J Indazolylpyrazolopyrimidine as highly potent B-Raf inhibitors with in vivo activity. J Med Chem53:7874-8 (2010) 
 
Serine/threonine-protein kinase B-raf
Name:Serine/threonine-protein kinase B-raf
Type:Serine/threonine-protein kinase
Mol. Mass.:84446.00
Organism:Homo sapiens (Human)
Description:P15056
Residue:766
BDBM50026207
NameBDBM50026207
Synonyms:CHEMBL1276170
TypeSmall organic molecule
Emp. Form.C30H25ClN8
Mol. Mass.533.026
SMILES[H][C@]12CN(c3ccc(c(Cl)c3)-c3ccnc4c(c(nn34)-c3ccncc3)-c3cccc4[nH]ncc34)[C@]([H])(CN1C)C2