Reaction Details
TargetSerine/threonine-protein kinase B-raf
LigandBDBM50330919
Substrate/Competitorn/a
Meas. Tech.ChEMBL_685663 (CHEMBL1285565)
IC50 0.510000±n/a nM
Citation Wang, XBerger, DMSalaski, EJTorres, NDutia, MHanna, CHu, YLevin, JIPowell, DWojciechowicz, DCollins, KFrommer, ELucas, J Indazolylpyrazolopyrimidine as highly potent B-Raf inhibitors with in vivo activity. J Med Chem53:7874-8 (2010) 
 
Serine/threonine-protein kinase B-raf
Name:Serine/threonine-protein kinase B-raf
Type:Serine/threonine-protein kinase
Mol. Mass.:84446.00
Organism:Homo sapiens (Human)
Description:P15056
Residue:766
BDBM50330919
NameBDBM50330919
Synonyms:3-(1H-indazol-4-yl)-7-(2-methyl-4-((1S,4S)-5-methyl-2,5-diazabicyclo[2.2.1]heptan-2-yl)phenyl)-2-(pyridin-4-yl)pyrazolo[1,5-a]pyrimidine | CHEMBL1276168
TypeSmall organic molecule
Emp. Form.C31H28N8
Mol. Mass.512.6076
SMILESCN1C[C@@H]2C[C@H]1CN2c1ccc(c(C)c1)-c1ccnc2c(c(nn12)-c1ccncc1)-c1cccc2[nH]ncc12