Reaction Details
TargetCruzipain
LigandBDBM50330929
Substrate/Competitorn/a
Meas. Tech.ChEMBL_683902 (CHEMBL1285900)
IC50 60±n/a nM
Citation Hernandes, MZRabello, MMLeite, ACCardoso, MVMoreira, DRBrondani, DJSimone, CAReis, LCSouza, MAPereira, VRFerreira, RSMcKerrow, JH Studies toward the structural optimization of novel thiazolylhydrazone-based potent antitrypanosomal agents. Bioorg Med Chem18:7826-35 (2010) 
 
Cruzipain
Name:Cruzipain
Type:Protein
Mol. Mass.:49831.41
Organism:Trypanosoma cruzi
Description:P25779
Residue:467
BDBM50330929
NameBDBM50330929
Synonyms:2-[(p-Methylphenyl)thiopropylidenehydrazinyl]-5-methylthiazolidine-4-thione | CHEMBL1275672
TypeSmall organic molecule
Emp. Form.C13H15N3S3
Mol. Mass.309.473
SMILESCc1sc(N=NCCCSc2ccccc2)nc1S