Reaction Details
TargetSodium channel protein type 10 subunit alpha
LigandBDBM50330933
Substrate/Competitorn/a
Meas. Tech.ChEMBL_684074 (CHEMBL1286451)
IC50 490±n/a nM
Citation Scanio, MJShi, LDrizin, IGregg, RJAtkinson, RNThomas, JBJohnson, MSChapman, MLLiu, DKrambis, MJLiu, YShieh, CCZhang, XSimler, GHJoshi, SHonore, PMarsh, KCKnox, AWerness, SAntonio, BKrafte, DSJarvis, MFFaltynek, CRMarron, BEKort, ME Discovery and biological evaluation of potent, selective, orally bioavailable, pyrazine-based blockers of the Na(v)1.8 sodium channel with efficacy in a model of neuropathic pain. Bioorg Med Chem18:7816-25 (2010) 
 
Sodium channel protein type 10 subunit alpha
Name:Sodium channel protein type 10 subunit alpha
Type:PROTEIN
Mol. Mass.:220545.77
Organism:Mus musculus
Description:ChEMBL_675096
Residue:1958
BDBM50330933
NameBDBM50330933
Synonyms:CHEMBL1277514 | N-(3,5-Dimethylphenyl)-6-(4-chlorophenyl)-pyrazine-2-carboxamide
TypeSmall organic molecule
Emp. Form.C19H16ClN3O
Mol. Mass.337.803
SMILESCc1cc(C)cc(NC(=O)c2cncc(n2)-c2ccc(Cl)cc2)c1