Reaction Details
TargetSodium channel protein type 10 subunit alpha
LigandBDBM50330940
Substrate/Competitorn/a
Meas. Tech.ChEMBL_684073 (CHEMBL1286450)
IC50 90±n/a nM
Citation Scanio, MJShi, LDrizin, IGregg, RJAtkinson, RNThomas, JBJohnson, MSChapman, MLLiu, DKrambis, MJLiu, YShieh, CCZhang, XSimler, GHJoshi, SHonore, PMarsh, KCKnox, AWerness, SAntonio, BKrafte, DSJarvis, MFFaltynek, CRMarron, BEKort, ME Discovery and biological evaluation of potent, selective, orally bioavailable, pyrazine-based blockers of the Na(v)1.8 sodium channel with efficacy in a model of neuropathic pain. Bioorg Med Chem18:7816-25 (2010) 
 
Sodium channel protein type 10 subunit alpha
Name:Sodium channel protein type 10 subunit alpha
Type:Enzyme
Mol. Mass.:219724.17
Organism:Rattus norvegicus (Rat)
Description:Q62968
Residue:1956
BDBM50330940
NameBDBM50330940
Synonyms:CHEMBL1276881 | N-((2-Chloropyridin-3-yl)methyl)-6-(4-(trifluoromethoxy)phenyl)pyrazine-2-carboxamide
TypeSmall organic molecule
Emp. Form.C18H12ClF3N4O2
Mol. Mass.408.762
SMILESFC(F)(F)Oc1ccc(cc1)-c1cncc(n1)C(=O)NCc1cccnc1Cl