Reaction Details
TargetSodium channel protein type 10 subunit alpha
LigandBDBM50330937
Substrate/Competitorn/a
Meas. Tech.ChEMBL_684075 (CHEMBL1286452)
IC50 6±n/a nM
Citation Scanio, MJShi, LDrizin, IGregg, RJAtkinson, RNThomas, JBJohnson, MSChapman, MLLiu, DKrambis, MJLiu, YShieh, CCZhang, XSimler, GHJoshi, SHonore, PMarsh, KCKnox, AWerness, SAntonio, BKrafte, DSJarvis, MFFaltynek, CRMarron, BEKort, ME Discovery and biological evaluation of potent, selective, orally bioavailable, pyrazine-based blockers of the Na(v)1.8 sodium channel with efficacy in a model of neuropathic pain. Bioorg Med Chem18:7816-25 (2010) 
 
Sodium channel protein type 10 subunit alpha
Name:Sodium channel protein type 10 subunit alpha
Type:Enzyme
Mol. Mass.:220609.21
Organism:Homo sapiens (Human)
Description:Q9Y5Y9
Residue:1956
BDBM50330937
NameBDBM50330937
Synonyms:CHEMBL1277513 | N-(m-Tolyl)-6-(4-chlorophenyl)-pyrazine-2-carboxamide
TypeSmall organic molecule
Emp. Form.C18H14ClN3O
Mol. Mass.323.776
SMILESCc1cccc(NC(=O)c2cncc(n2)-c2ccc(Cl)cc2)c1