Reaction Details
TargetSodium channel protein type 10 subunit alpha
LigandBDBM50330943
Substrate/Competitorn/a
Meas. Tech.ChEMBL_684075 (CHEMBL1286452)
IC50 27±n/a nM
Citation Scanio, MJShi, LDrizin, IGregg, RJAtkinson, RNThomas, JBJohnson, MSChapman, MLLiu, DKrambis, MJLiu, YShieh, CCZhang, XSimler, GHJoshi, SHonore, PMarsh, KCKnox, AWerness, SAntonio, BKrafte, DSJarvis, MFFaltynek, CRMarron, BEKort, ME Discovery and biological evaluation of potent, selective, orally bioavailable, pyrazine-based blockers of the Na(v)1.8 sodium channel with efficacy in a model of neuropathic pain. Bioorg Med Chem18:7816-25 (2010) 
 
Sodium channel protein type 10 subunit alpha
Name:Sodium channel protein type 10 subunit alpha
Type:Enzyme
Mol. Mass.:220609.21
Organism:Homo sapiens (Human)
Description:Q9Y5Y9
Residue:1956
BDBM50330943
NameBDBM50330943
Synonyms:CHEMBL1277606 | N-(2-Methylbenzyl)-6-(4-chlorophenyl)-pyrazine-2-carboxamide
TypeSmall organic molecule
Emp. Form.C19H16ClN3O
Mol. Mass.337.803
SMILESCc1ccccc1CNC(=O)c1cncc(n1)-c1ccc(Cl)cc1