Reaction Details
TargetSodium channel protein type 10 subunit alpha
LigandBDBM50329217
Substrate/Competitorn/a
Meas. Tech.ChEMBL_684073 (CHEMBL1286450)
IC50 34±n/a nM
Citation Scanio, MJShi, LDrizin, IGregg, RJAtkinson, RNThomas, JBJohnson, MSChapman, MLLiu, DKrambis, MJLiu, YShieh, CCZhang, XSimler, GHJoshi, SHonore, PMarsh, KCKnox, AWerness, SAntonio, BKrafte, DSJarvis, MFFaltynek, CRMarron, BEKort, ME Discovery and biological evaluation of potent, selective, orally bioavailable, pyrazine-based blockers of the Na(v)1.8 sodium channel with efficacy in a model of neuropathic pain. Bioorg Med Chem18:7816-25 (2010) 
 
Sodium channel protein type 10 subunit alpha
Name:Sodium channel protein type 10 subunit alpha
Type:Enzyme
Mol. Mass.:219724.17
Organism:Rattus norvegicus (Rat)
Description:Q62968
Residue:1956
BDBM50329217
NameBDBM50329217
Synonyms:CHEMBL1271106 N-(3,5-dimethylphenyl)-6-(4-(trifluoromethoxy)phenyl)pyrazine-2-carboxamide
TypeSmall organic molecule
Emp. Form.C20H16F3N3O2
Mol. Mass.387.3551
SMILESCc1cc(C)cc(NC(=O)c2cncc(n2)-c2ccc(OC(F)(F)F)cc2)c1