Reaction Details
TargetSodium channel protein type 10 subunit alpha
LigandBDBM50330945
Substrate/Competitorn/a
Meas. Tech.ChEMBL_684074 (CHEMBL1286451)
IC50 66±n/a nM
Citation Scanio, MJShi, LDrizin, IGregg, RJAtkinson, RNThomas, JBJohnson, MSChapman, MLLiu, DKrambis, MJLiu, YShieh, CCZhang, XSimler, GHJoshi, SHonore, PMarsh, KCKnox, AWerness, SAntonio, BKrafte, DSJarvis, MFFaltynek, CRMarron, BEKort, ME Discovery and biological evaluation of potent, selective, orally bioavailable, pyrazine-based blockers of the Na(v)1.8 sodium channel with efficacy in a model of neuropathic pain. Bioorg Med Chem18:7816-25 (2010) 
 
Sodium channel protein type 10 subunit alpha
Name:Sodium channel protein type 10 subunit alpha
Type:PROTEIN
Mol. Mass.:220545.77
Organism:Mus musculus
Description:ChEMBL_675096
Residue:1958
BDBM50330945
NameBDBM50330945
Synonyms:CHEMBL1278223 | N-(m-Tolyl)-6-(4-trifluoromethoxyphenyl)-pyrazine-2-carboxamide
TypeSmall organic molecule
Emp. Form.C19H14F3N3O2
Mol. Mass.373.3286
SMILESCc1cccc(NC(=O)c2cncc(n2)-c2ccc(OC(F)(F)F)cc2)c1