Reaction Details
TargetSodium channel protein type 10 subunit alpha
LigandBDBM50330944
Substrate/Competitorn/a
Meas. Tech.ChEMBL_684073 (CHEMBL1286450)
IC50 84±n/a nM
Citation Scanio, MJShi, LDrizin, IGregg, RJAtkinson, RNThomas, JBJohnson, MSChapman, MLLiu, DKrambis, MJLiu, YShieh, CCZhang, XSimler, GHJoshi, SHonore, PMarsh, KCKnox, AWerness, SAntonio, BKrafte, DSJarvis, MFFaltynek, CRMarron, BEKort, ME Discovery and biological evaluation of potent, selective, orally bioavailable, pyrazine-based blockers of the Na(v)1.8 sodium channel with efficacy in a model of neuropathic pain. Bioorg Med Chem18:7816-25 (2010) 
 
Sodium channel protein type 10 subunit alpha
Name:Sodium channel protein type 10 subunit alpha
Type:Enzyme
Mol. Mass.:219724.17
Organism:Rattus norvegicus (Rat)
Description:Q62968
Residue:1956
BDBM50330944
NameBDBM50330944
Synonyms:CHEMBL1278044 | N-(3,5-Dimethylphenyl)-6-(4-cyanophenyl)-pyrazine-2-carboxamide
TypeSmall organic molecule
Emp. Form.C20H16N4O
Mol. Mass.328.3672
SMILESCc1cc(C)cc(NC(=O)c2cncc(n2)-c2ccc(cc2)C#N)c1