Reaction Details
Target17-beta-hydroxysteroid dehydrogenase type 1
LigandBDBM50330999
Substrate/Competitorn/a
Meas. Tech.ChEMBL_684635 (CHEMBL1285468)
IC50 8±n/a nM
Citation Oster, AHinsberger, SWerth, RMarchais-Oberwinkler, SFrotscher, MHartmann, RW Bicyclic substituted hydroxyphenylmethanones as novel inhibitors of 17ß-hydroxysteroid dehydrogenase type 1 (17ß-HSD1) for the treatment of estrogen-dependent diseases. J Med Chem53:8176-86 (2010) 
 
17-beta-hydroxysteroid dehydrogenase type 1
Name:17-beta-hydroxysteroid dehydrogenase type 1
Type:Enzyme
Mol. Mass.:34945.13
Organism:Homo sapiens (Human)
Description:P14061
Residue:328
BDBM50330999
NameBDBM50330999
Synonyms:CHEMBL1277708 | [5-(4-Hydroxy-3-methylphenyl)-2-thienyl](3-hydroxyphenyl)-methanone
TypeSmall organic molecule
Emp. Form.C18H14O3S
Mol. Mass.310.367
SMILESCc1cc(ccc1O)-c1ccc(s1)C(=O)c1cccc(O)c1