Reaction Details
TargetNeuronal acetylcholine receptor subunit alpha-3/beta-4
LigandBDBM50331016
Substrate/Competitorn/a
Meas. Tech.ChEMBL_684750 (CHEMBL1285777)
EC50 2000±n/a nM
Citation Zaveri, NJiang, FOlsen, CPolgar, WToll, L Novela3ß4 nicotinic acetylcholine receptor-selective ligands. Discovery, structure-activity studies, and pharmacological evaluation. J Med Chem53:8187-91 (2010) 
 
Neuronal acetylcholine receptor subunit alpha-3/beta-4
Name:Neuronal acetylcholine receptor subunit alpha-3/beta-4
Type:Protein
Mol. Mass.:n/a
Description:n/a
Components:This complex has 2 components.
Component 1
Name:Neuronal acetylcholine receptor subunit alpha-3
Synonyms:ACHA3_RAT Chrna3
Type:Enzyme
Mol. Mass.:56995.52
Organism:Rattus norvegicus (Rat)
Description:P04757
Residue:499
Component 2
Name:Neuronal acetylcholine receptor subunit beta-4
Synonyms:ACHB4_RAT Chrnb4 Neuronal acetylcholine receptor non-alpha-2 chain | Neuronal acetylcholine receptor protein beta-4 subunit
Type:Enzyme
Mol. Mass.:55863.89
Organism:Rattus norvegicus (Rat)
Description:P12392
Residue:495
BDBM50331016
NameBDBM50331016
Synonyms:6-benzyl-3-(pyridin-3-yl)-6-azabicyclo[3.2.2]non-2-ene | CHEMBL1277968
TypeSmall organic molecule
Emp. Form.C20H22N2
Mol. Mass.290.4021
SMILESC(N1CC2CCC1CC(=C2)c1cccnc1)c1ccccc1