Reaction Details
TargetPlatelet-derived growth factor receptor beta
LigandBDBM50331025
Substrate/Competitorn/a
Meas. Tech.ChEMBL_684762 (CHEMBL1285789)
IC50 3±n/a nM
Citation Cho, TPDong, SYJun, FHong, FJLiang, YJLu, XHua, PJLi, LYLei, ZBing, HYing, ZQiong, LFBei, FBGuang, LLShen, GAHong, SGHong, SWTai, MX Novel potent orally active multitargeted receptor tyrosine kinase inhibitors: synthesis, structure-activity relationships, and antitumor activities of 2-indolinone derivatives. J Med Chem53:8140-9 (2010) 
 
Platelet-derived growth factor receptor beta
Name:Platelet-derived growth factor receptor beta
Type:Enzyme
Mol. Mass.:123922.25
Organism:Homo sapiens (Human)
Description:P09619
Residue:1106
BDBM50331025
NameBDBM50331025
Synonyms:(Z)-2-(5-Bromo-2-oxo-1,2-dihydro-indol-3-ylidenemethyl)-5-(2-diethylamino-ethyl)-3-methyl-1,5,6,7-tetrahydro-pyrrolo[3,2-c]pyridin-4-one | CHEMBL1278233
TypeSmall organic molecule
Emp. Form.C23H27BrN4O2
Mol. Mass.471.39
SMILESCCN(CC)CCN1CCc2[nH]c(\C=C3/C(=O)Nc4ccc(Br)cc34)c(C)c2C1=O