Reaction Details
TargetPlatelet-derived growth factor receptor beta
LigandBDBM50331029
Substrate/Competitorn/a
Meas. Tech.ChEMBL_684762 (CHEMBL1285789)
IC50 8±n/a nM
Citation Cho, TPDong, SYJun, FHong, FJLiang, YJLu, XHua, PJLi, LYLei, ZBing, HYing, ZQiong, LFBei, FBGuang, LLShen, GAHong, SGHong, SWTai, MX Novel potent orally active multitargeted receptor tyrosine kinase inhibitors: synthesis, structure-activity relationships, and antitumor activities of 2-indolinone derivatives. J Med Chem53:8140-9 (2010) 
 
Platelet-derived growth factor receptor beta
Name:Platelet-derived growth factor receptor beta
Type:Enzyme
Mol. Mass.:123922.25
Organism:Homo sapiens (Human)
Description:P09619
Residue:1106
BDBM50331029
NameBDBM50331029
Synonyms:(R,Z)-2-(5-Fluoro-2-oxo-1,2-dihydro-indol-3-ylidenemethyl)-5-(2-hydroxy-3-morpholin-4-ylpropyl)-3-methyl-1,5,6,7-tetrahydro-pyrrolo[3,2-c]pyridin-4-one | CHEMBL1276980
TypeSmall organic molecule
Emp. Form.C24H27FN4O4
Mol. Mass.454.494
SMILESCc1c(\C=C2/C(=O)Nc3ccc(F)cc23)[nH]c2CCN(C[C@H](O)CN3CCOCC3)C(=O)c12