Reaction Details
TargetVascular endothelial growth factor receptor 2
LigandBDBM50331031
Substrate/Competitorn/a
Meas. Tech.ChEMBL_684763 (CHEMBL1285790)
IC50 36±n/a nM
Citation Cho, TPDong, SYJun, FHong, FJLiang, YJLu, XHua, PJLi, LYLei, ZBing, HYing, ZQiong, LFBei, FBGuang, LLShen, GAHong, SGHong, SWTai, MX Novel potent orally active multitargeted receptor tyrosine kinase inhibitors: synthesis, structure-activity relationships, and antitumor activities of 2-indolinone derivatives. J Med Chem53:8140-9 (2010) 
 
Vascular endothelial growth factor receptor 2
Name:Vascular endothelial growth factor receptor 2
Type:Receptor Tyrosine Kinase
Mol. Mass.:151510.97
Organism:Homo sapiens (Human)
Description:P35968
Residue:1356
BDBM50331031
NameBDBM50331031
Synonyms:(Z)-2-(5-Fluoro-2-oxo-1,2-dihydro-indol-3-ylidenemethyl)-3-methyl-5-(2-morpholin-4-yl-ethyl)-5,6,7,8-tetrahydro-1H-pyrrolo[3,2-c]azepin-4-one | CHEMBL1277071
TypeSmall organic molecule
Emp. Form.C24H27FN4O3
Mol. Mass.438.4946
SMILESCc1c(\C=C2/C(=O)Nc3ccc(F)cc23)[nH]c2CCCN(CCN3CCOCC3)C(=O)c12