Reaction Details
TargetVascular endothelial growth factor receptor 2
LigandBDBM50331033
Substrate/Competitorn/a
Meas. Tech.ChEMBL_684763 (CHEMBL1285790)
IC50 215±n/a nM
Citation Cho, TPDong, SYJun, FHong, FJLiang, YJLu, XHua, PJLi, LYLei, ZBing, HYing, ZQiong, LFBei, FBGuang, LLShen, GAHong, SGHong, SWTai, MX Novel potent orally active multitargeted receptor tyrosine kinase inhibitors: synthesis, structure-activity relationships, and antitumor activities of 2-indolinone derivatives. J Med Chem53:8140-9 (2010) 
 
Vascular endothelial growth factor receptor 2
Name:Vascular endothelial growth factor receptor 2
Type:Receptor Tyrosine Kinase
Mol. Mass.:151510.97
Organism:Homo sapiens (Human)
Description:P35968
Residue:1356
BDBM50331033
NameBDBM50331033
Synonyms:(Z)-5-(2-Diethylamino-ethyl)-2-(5-fluoro-2-oxo-1,2-dihydro-indol-3-ylidenemethyl)-3-methyl-6,7,8,9-tetrahydro-1H,5H-1,5-diaza-cyclopentacycloocten-4-one | CHEMBL1277161
TypeSmall organic molecule
Emp. Form.C25H31FN4O2
Mol. Mass.438.5376
SMILESCCN(CC)CCN1CCCCc2[nH]c(\C=C3/C(=O)Nc4ccc(F)cc34)c(C)c2C1=O