Reaction Details
TargetNeuromedin-K receptor
LigandBDBM50051293
Substrate/Competitorn/a
Meas. Tech.ChEMBL_684807 (CHEMBL1285944)
Ki 2.51±n/a nM
Citation Geldenhuys, WJKuzenko, SRSimmons, MA Virtual screening to identify novel antagonists for the G protein-coupled NK3 receptor. J Med Chem53:8080-8 (2010) 
 
Neuromedin-K receptor
Name:Neuromedin-K receptor
Type:Enzyme
Mol. Mass.:52221.96
Organism:Homo sapiens (Human)
Description:P29371
Residue:465
BDBM50051293
NameBDBM50051293
Synonyms:(S)-(-)-N-(R-ethylbenzyl)-3-hydroxy-2-phenylquinoline-4-carboxamide 3-Hydroxy-2-phenyl-quinoline-4-carboxylic acid (1-phenyl-propyl)-amide SB 223412 SB-223412 | Talnetant
TypeSmall organic molecule
Emp. Form.C25H22N2O2
Mol. Mass.382.4544
SMILESCC[C@H](NC(=O)c1c(O)c(nc2ccccc12)-c1ccccc1)c1ccccc1